Reaction Details
TargetAminopeptidase N
LigandBDBM50129681
Substrate/Competitorn/a
Meas. Tech.ChEMBL_35503 (CHEMBL646413)
Ki 36±n/a nM
Citation Grembecka, JMucha, ACierpicki, TKafarski, P The most potent organophosphorus inhibitors of leucine aminopeptidase. Structure-based design, chemistry, and activity. J Med Chem46:2641-55 (2003) 
 
Aminopeptidase N
Name:Aminopeptidase N
Type:Protein
Mol. Mass.:108810.25
Organism:Sus scrofa (Pig)
Description:P15145
Residue:963
BDBM50129681
NameBDBM50129681
Synonyms:3-[(1-Amino-3-phenyl-propyl)-hydroxy-phosphinoyl]-2-(4-hydroxy-benzyl)-propionic acid | CHEMBL88808
TypeSmall organic molecule
Emp. Form.C19H24NO5P
Mol. Mass.377.3713
SMILESOC(=O)C(Cc1ccc(O)cc1)CP(O)(O)C(=N)CCc1ccccc1