Reaction Details
TargetCytosol aminopeptidase
LigandBDBM50129682
Substrate/Competitorn/a
Meas. Tech.ChEMBL_98401 (CHEMBL881814)
Ki 74±n/a nM
Citation Grembecka, JMucha, ACierpicki, TKafarski, P The most potent organophosphorus inhibitors of leucine aminopeptidase. Structure-based design, chemistry, and activity. J Med Chem46:2641-55 (2003) 
 
Cytosol aminopeptidase
Name:Cytosol aminopeptidase
Type:PROTEIN
Mol. Mass.:56171.75
Organism:Homo sapiens (Human)
Description:ChEMBL_1507539
Residue:519
BDBM50129682
NameBDBM50129682
Synonyms:2-[(1-Amino-3-phenyl-propyl)-hydroxy-phosphinoylmethyl]-4-methyl-pentanoic acid | CHEMBL327182
TypeSmall organic molecule
Emp. Form.C16H26NO4P
Mol. Mass.327.3557
SMILESCC(C)CC(CP(O)(O)C(=N)CCc1ccccc1)C(O)=O