Reaction Details
TargetReverse transcriptase/RNaseH
LigandBDBM50130700
Substrate/Competitorn/a
Meas. Tech.ChEMBL_195660 (CHEMBL800044)
IC50 650±n/a nM
Citation Choi, YGeorge, CComin, MJBarchi, JJKim, HSJacobson, KABalzarini, JMitsuya, HBoyer, PLHughes, SHMarquez, VE A conformationally locked analogue of the anti-HIV agent stavudine. An important correlation between pseudorotation and maximum amplitude. J Med Chem46:3292-9 (2003) 
 
Reverse transcriptase/RNaseH
Name:Reverse transcriptase/RNaseH
Type:PROTEIN
Mol. Mass.:65229.15
Organism:Human immunodeficiency virus 1
Description:ChEMBL_1473730
Residue:566
BDBM50130700
NameBDBM50130700
Synonyms:1-(5-Hydroxymethyl-bicyclo[3.1.0]hex-3-en-2-yl)-5-methyl-1H-pyrimidine-2,4-dione; triphosphate
TypeSmall organic molecule
Emp. Form.C12H13N2O12P3
Mol. Mass.470.1613
SMILESCc1cn(C2C=C[C@]3(COP([O-])(=O)OP([O-])(=O)OP([O-])([O-])=O)C[C@H]23)c(=O)[nH]c1=O