Reaction Details
TargetLanosterol synthase
LigandBDBM50128065
Substrate/Competitorn/a
Meas. Tech.ChEMBL_80 (CHEMBL615201)
IC50 6.5±n/a nM
Citation Dehmlow, HAebi, JDJolidon, SJi, YHvon der Mark, EMHimber, JMorand, OH Synthesis and structure-activity studies of novel orally active non-terpenoic 2,3-oxidosqualene cyclase inhibitors. J Med Chem46:3354-70 (2003) 
 
Lanosterol synthase
Name:Lanosterol synthase
Type:PROTEIN
Mol. Mass.:83309.32
Organism:Homo sapiens (Human)
Description:ChEMBL_11231
Residue:732
BDBM50128065
NameBDBM50128065
Synonyms:CHEMBL304858 N-allyl-6-(4-(4-bromobenzoyl)-3-fluorophenoxy)-N-methylhexan-1-aminium {4-[6-(Allyl-methyl-amino)-hexyloxy]-2-fluoro-phenyl}-(4-bromo-phenyl)-methanone
TypeSmall organic molecule
Emp. Form.C23H27BrFNO2
Mol. Mass.448.368
SMILESCN(CCCCCCOc1ccc(C(=O)c2ccc(Br)cc2)c(F)c1)CC=C