Reaction Details
TargetNH(3)-dependent NAD(+) synthetase
LigandBDBM50130794
Substrate/Competitorn/a
Meas. Tech.ChEMBL_141613 (CHEMBL747929)
IC50>1000000±n/a nM
Citation Velu, SECristofoli, WAGarcia, GJBrouillette, CGPierson, MCLuan, CHDeLucas, LJBrouillette, WJ Tethered dimers as NAD synthetase inhibitors with antibacterial activity. J Med Chem46:3371-81 (2003) 
 
NH(3)-dependent NAD(+) synthetase
Name:NH(3)-dependent NAD(+) synthetase
Type:PROTEIN
Mol. Mass.:30386.77
Organism:Bacillus subtilis
Description:ChEMBL_141613
Residue:272
BDBM50130794
NameBDBM50130794
Synonyms:CHEMBL115550 | Nicotinic acid 5-(5-nitro-indol-1-yl)-pentyl ester
TypeSmall organic molecule
Emp. Form.C19H19N3O4
Mol. Mass.353.3719
SMILES[O-][N+](=O)c1ccc2n(CCCCCOC(=O)c3cccnc3)ccc2c1