Reaction Details
TargetNH(3)-dependent NAD(+) synthetase
LigandBDBM50130798
Substrate/Competitorn/a
Meas. Tech.ChEMBL_141613 (CHEMBL747929)
IC50 84000±n/a nM
Citation Velu, SECristofoli, WAGarcia, GJBrouillette, CGPierson, MCLuan, CHDeLucas, LJBrouillette, WJ Tethered dimers as NAD synthetase inhibitors with antibacterial activity. J Med Chem46:3371-81 (2003) 
 
NH(3)-dependent NAD(+) synthetase
Name:NH(3)-dependent NAD(+) synthetase
Type:PROTEIN
Mol. Mass.:30386.77
Organism:Bacillus subtilis
Description:ChEMBL_141613
Residue:272
BDBM50130798
NameBDBM50130798
Synonyms:CHEMBL334066 | Trimethyl-{4-[6-(5-nitro-indol-1-yl)-hexyloxycarbonylmethyl]-phenyl}-ammonium; iodide
TypeSmall organic molecule
Emp. Form.C25H32N3O4
Mol. Mass.438.5387
SMILESC[N+](C)(C)c1ccc(CC(=O)OCCCCCCn2ccc3cc(ccc23)[N+]([O-])=O)cc1