Reaction Details
TargetNH(3)-dependent NAD(+) synthetase
LigandBDBM18069
Substrate/Competitorn/a
Meas. Tech.ChEMBL_141613 (CHEMBL747929)
IC50>1000±n/a nM
Citation Velu, SECristofoli, WAGarcia, GJBrouillette, CGPierson, MCLuan, CHDeLucas, LJBrouillette, WJ Tethered dimers as NAD synthetase inhibitors with antibacterial activity. J Med Chem46:3371-81 (2003) 
 
NH(3)-dependent NAD(+) synthetase
Name:NH(3)-dependent NAD(+) synthetase
Type:PROTEIN
Mol. Mass.:30386.77
Organism:Bacillus subtilis
Description:ChEMBL_141613
Residue:272
BDBM18069
NameBDBM18069
Synonyms:5-[(3,4,5-trimethoxyphenyl)methyl]pyrimidine-2,4-diamine TMP Trimethoprim (TMP) | US10870625, Compound TMP
TypeSmall organic molecule
Emp. Form.C14H18N4O3
Mol. Mass.290.3177
SMILESCOc1cc(Cc2cnc(N)nc2N)cc(OC)c1OC