Reaction Details
TargetNH(3)-dependent NAD(+) synthetase
LigandBDBM50130800
Substrate/Competitorn/a
Meas. Tech.ChEMBL_141613 (CHEMBL747929)
IC50 24000±n/a nM
Citation Velu, SECristofoli, WAGarcia, GJBrouillette, CGPierson, MCLuan, CHDeLucas, LJBrouillette, WJ Tethered dimers as NAD synthetase inhibitors with antibacterial activity. J Med Chem46:3371-81 (2003) 
 
NH(3)-dependent NAD(+) synthetase
Name:NH(3)-dependent NAD(+) synthetase
Type:PROTEIN
Mol. Mass.:30386.77
Organism:Bacillus subtilis
Description:ChEMBL_141613
Residue:272
BDBM50130800
NameBDBM50130800
Synonyms:3-[7-(5-Methoxy-indol-1-yl)-heptyloxycarbonyl]-1-methyl-pyridinium; iodide | CHEMBL116227
TypeSmall organic molecule
Emp. Form.C23H29N2O3
Mol. Mass.381.4874
SMILESCOc1ccc2n(CCCCCCCOC(=O)c3ccc[n+](C)c3)ccc2c1