Reaction Details
TargetNH(3)-dependent NAD(+) synthetase
LigandBDBM50130811
Substrate/Competitorn/a
Meas. Tech.ChEMBL_141613 (CHEMBL747929)
IC50 54000±n/a nM
Citation Velu, SECristofoli, WAGarcia, GJBrouillette, CGPierson, MCLuan, CHDeLucas, LJBrouillette, WJ Tethered dimers as NAD synthetase inhibitors with antibacterial activity. J Med Chem46:3371-81 (2003) 
 
NH(3)-dependent NAD(+) synthetase
Name:NH(3)-dependent NAD(+) synthetase
Type:PROTEIN
Mol. Mass.:30386.77
Organism:Bacillus subtilis
Description:ChEMBL_141613
Residue:272
BDBM50130811
NameBDBM50130811
Synonyms:CHEMBL114006 | [4-(9-Indol-1-yl-nonyloxycarbonylmethyl)-phenyl]-trimethyl-ammonium; iodide
TypeSmall organic molecule
Emp. Form.C28H39N2O2
Mol. Mass.435.6209
SMILESC[N+](C)(C)c1ccc(CC(=O)OCCCCCCCCCn2ccc3ccccc23)cc1