Reaction Details
TargetD(3) dopamine receptor
LigandBDBM50131932
Substrate/Competitorn/a
Meas. Tech.ChEMBL_62751 (CHEMBL674592)
Ki 11±n/a nM
Citation Campiani, GButini, STrotta, FFattorusso, CCatalanotti, BAiello, FGemma, SNacci, VNovellino, EStark, JACagnotto, AFumagalli, ECarnovali, FCervo, LMennini, T Synthesis and pharmacological evaluation of potent and highly selective D3 receptor ligands: inhibition of cocaine-seeking behavior and the role of dopamine D3/D2 receptors. J Med Chem46:3822-39 (2003) 
 
D(3) dopamine receptor
Name:D(3) dopamine receptor
Type:Protein
Mol. Mass.:49540.58
Organism:Rattus norvegicus (Rat)
Description:P19020
Residue:446
BDBM50131932
NameBDBM50131932
Synonyms:CHEMBL127344 | Quinoxaline-2-carboxylic acid {4-[4-(2-methoxy-phenyl)-piperazin-1-yl]-butyl}-amide
TypeSmall organic molecule
Emp. Form.C24H29N5O2
Mol. Mass.419.5194
SMILESCOc1ccccc1N1CCN(CCCCNC(=O)c2cnc3ccccc3n2)CC1