Reaction Details
TargetD(3) dopamine receptor
LigandBDBM50131935
Substrate/Competitorn/a
Meas. Tech.ChEMBL_62751 (CHEMBL674592)
Ki 28±n/a nM
Citation Campiani, GButini, STrotta, FFattorusso, CCatalanotti, BAiello, FGemma, SNacci, VNovellino, EStark, JACagnotto, AFumagalli, ECarnovali, FCervo, LMennini, T Synthesis and pharmacological evaluation of potent and highly selective D3 receptor ligands: inhibition of cocaine-seeking behavior and the role of dopamine D3/D2 receptors. J Med Chem46:3822-39 (2003) 
 
D(3) dopamine receptor
Name:D(3) dopamine receptor
Type:Protein
Mol. Mass.:49540.58
Organism:Rattus norvegicus (Rat)
Description:P19020
Residue:446
BDBM50131935
NameBDBM50131935
Synonyms:CHEMBL126590 | Pyrrolo[1,2-a]quinoxaline-4-carboxylic acid {4-[4-(2-methoxy-phenyl)-piperazin-1-yl]-butyl}-amide
TypeSmall organic molecule
Emp. Form.C27H31N5O2
Mol. Mass.457.5673
SMILESCOc1ccccc1N1CCN(CCCCNC(=O)c2nc3ccccc3n3cccc23)CC1