Reaction Details
TargetD(2) dopamine receptor
LigandBDBM50131923
Substrate/Competitorn/a
Meas. Tech.ChEMBL_62233 (CHEMBL675744)
Ki 409±n/a nM
Citation Campiani, GButini, STrotta, FFattorusso, CCatalanotti, BAiello, FGemma, SNacci, VNovellino, EStark, JACagnotto, AFumagalli, ECarnovali, FCervo, LMennini, T Synthesis and pharmacological evaluation of potent and highly selective D3 receptor ligands: inhibition of cocaine-seeking behavior and the role of dopamine D3/D2 receptors. J Med Chem46:3822-39 (2003) 
 
D(2) dopamine receptor
Name:D(2) dopamine receptor
Type:G Protein-Coupled Receptor (GPCR)
Mol. Mass.:50931.60
Organism:Rattus norvegicus (rat)
Description:P61169
Residue:444
BDBM50131923
NameBDBM50131923
Synonyms:Benzofuran-2-carboxylic acid {4-[4-(2,4-dichloro-phenyl)-piperazin-1-yl]-butyl}-amide | CHEMBL435218
TypeSmall organic molecule
Emp. Form.C23H25Cl2N3O2
Mol. Mass.446.37
SMILESClc1ccc(N2CCN(CCCCNC(=O)c3cc4ccccc4o3)CC2)c(Cl)c1