Reaction Details
TargetD(1A) dopamine receptor
LigandBDBM50131934
Substrate/Competitorn/a
Meas. Tech.ChEMBL_58521 (CHEMBL672016)
Ki 1350±n/a nM
Citation Campiani, GButini, STrotta, FFattorusso, CCatalanotti, BAiello, FGemma, SNacci, VNovellino, EStark, JACagnotto, AFumagalli, ECarnovali, FCervo, LMennini, T Synthesis and pharmacological evaluation of potent and highly selective D3 receptor ligands: inhibition of cocaine-seeking behavior and the role of dopamine D3/D2 receptors. J Med Chem46:3822-39 (2003) 
 
D(1A) dopamine receptor
Name:D(1A) dopamine receptor
Type:Enzyme Catalytic Domain
Mol. Mass.:49429.75
Organism:RAT
Description:P18901
Residue:446
BDBM50131934
NameBDBM50131934
Synonyms:CHEMBL126439 Quinoline-2-carboxylic acid {4-[4-(2-methoxy-phenyl)-piperazin-1-yl]-butyl}-amide
TypeSmall organic molecule
Emp. Form.C25H30N4O2
Mol. Mass.418.5313
SMILESCOc1ccccc1N1CCN(CCCCNC(=O)c2ccc3ccccc3n2)CC1