Reaction Details
TargetHydroxycarboxylic acid receptor 2
LigandBDBM50132142
Substrate/Competitorn/a
Meas. Tech.ChEMBL_144336 (CHEMBL751847)
Ki 3540±n/a nM
Citation van Herk, TBrussee, Jvan den Nieuwendijk, AMvan der Klein, PAIJzerman, APStannek, CBurmeister, ALorenzen, A Pyrazole derivatives as partial agonists for the nicotinic acid receptor. J Med Chem46:3945-51 (2003) 
 
Hydroxycarboxylic acid receptor 2
Name:Hydroxycarboxylic acid receptor 2
Type:PROTEIN
Mol. Mass.:41476.06
Organism:Rattus norvegicus
Description:ChEMBL_820675
Residue:360
BDBM50132142
NameBDBM50132142
Synonyms:4,5,6,7-Tetrahydro-1H-indazole-3-carboxylic acid CHEMBL338405
TypeSmall organic molecule
Emp. Form.C8H10N2O2
Mol. Mass.166.1772
SMILESOC(=O)c1n[nH]c2CCCCc12