Reaction Details
TargetProthrombin
LigandBDBM50133093
Substrate/Competitorn/a
Meas. Tech.ChEMBL_207996 (CHEMBL816078)
IC50 40±n/a nM
Citation Parlow, JJDice, TALachance, RMGirard, TJStevens, AMStegeman, RAStallings, WCKurumbail, RGSouth, MS Polymer-assisted solution-phase library synthesis and crystal structure of alpha-ketothiazoles as tissue factor VIIa inhibitors. J Med Chem46:4043-9 (2003) 
 
Prothrombin
Name:Prothrombin
Type:Protein
Mol. Mass.:70029.57
Organism:Homo sapiens (Human)
Description:P00734
Residue:622
BDBM50133093
NameBDBM50133093
Synonyms:(R)-N-{(S)-1-[(S)-4-guanidino-1-(thiazole-2-carbonyl)-butylcarbamoyl]-2-hydroxy-ethyl}-3-phenyl-2-phenylmethanesulfonylamino-propionamide | CHEMBL275859
TypeSmall organic molecule
Emp. Form.C28H35N7O6S2
Mol. Mass.629.751
SMILESNC(=N)NCCC[C@H](NC(=O)[C@H](CO)NC(=O)[C@@H](Cc1ccccc1)NS(=O)(=O)Cc1ccccc1)C(=O)c1nccs1