Reaction Details
TargetKappa-type opioid receptor
LigandBDBM50133224
Substrate/Competitorn/a
Meas. Tech.ChEMBL_145707 (CHEMBL753915)
Ki 0.4±n/a nM
Citation Schütz, JSpetea, MKoch, MAceto, MDHarris, LSCoop, ASchmidhammer, H Synthesis and biological evaluation of 14-alkoxymorphinans. 20. 14-phenylpropoxymetopon: an extremely powerful analgesic. J Med Chem46:4182-7 (2003) 
 
Kappa-type opioid receptor
Name:Kappa-type opioid receptor
Type:G Protein-Coupled Receptor (GPCR)
Mol. Mass.:42692.90
Organism:Rattus norvegicus (rat)
Description:P34975
Residue:380
BDBM50133224
NameBDBM50133224
Synonyms:10-hydroxy-4,13-dimethyl-17-(3-phenylpropoxy)-12-oxa-4-azapentacyclo[9.6.1.01,13.05,17.07,18]octadeca-7(18),8,10,15-tetraen-14-one | CHEMBL335969
TypeSmall organic molecule
Emp. Form.C28H33NO4
Mol. Mass.447.5659
SMILESCCC[C@]12c3c4O[C@@]1(C)C(=O)C=C[C@@]2(OCCCc1ccccc1)C(Cc3ccc4O)NC