Reaction Details
TargetDelta-type opioid receptor
LigandBDBM50367123
Substrate/Competitorn/a
Meas. Tech.ChEMBL_146916 (CHEMBL757504)
Ki 0.27±n/a nM
Citation Schütz, JSpetea, MKoch, MAceto, MDHarris, LSCoop, ASchmidhammer, H Synthesis and biological evaluation of 14-alkoxymorphinans. 20. 14-phenylpropoxymetopon: an extremely powerful analgesic. J Med Chem46:4182-7 (2003) 
 
Delta-type opioid receptor
Name:Delta-type opioid receptor
Type:G Protein-Coupled Receptor (GPCR)
Mol. Mass.:40465.04
Organism:Rattus norvegicus (rat)
Description:Competition binding assays were using CHO-K1 cell membranes expressing the opioid receptor.
Residue:372
BDBM50367123
NameBDBM50367123
Synonyms:ETORPHINE | M99
TypeSmall organic molecule
Emp. Form.C24H31NO4
Mol. Mass.397.5072
SMILESCCC[C@](C)(O)[C@H]1C[C@]23C=C[C@]1(O)[C@@H]1Oc4c5c(C[C@H]2N(C)CC[C@@]315)ccc4O