Reaction Details
TargetAlpha-1D adrenergic receptor
LigandBDBM50122799
Substrate/Competitorn/a
Meas. Tech.ChEMBL_32720 (CHEMBL645992)
Ki 4.8±n/a nM
Citation Balle, TPerregaard, JRamirez, MTLarsen, AKSøby, KKLiljefors, TAndersen, K Synthesis and structure-affinity relationship investigations of 5-heteroaryl-substituted analogues of the antipsychotic sertindole. A new class of highly selective alpha(1) adrenoceptor antagonists. J Med Chem46:265-83 (2003) 
 
Alpha-1D adrenergic receptor
Name:Alpha-1D adrenergic receptor
Type:Protein
Mol. Mass.:59375.97
Organism:Rattus norvegicus (Rat)
Description:P23944
Residue:561
BDBM50122799
NameBDBM50122799
Synonyms:1-(2-{4-[1-(4-Fluoro-phenyl)-5-(1-methyl-1H-pyrazol-3-yl)-1H-indol-3-yl]-piperidin-1-yl}-ethyl)-imidazolidin-2-one | CHEMBL93923
TypeSmall organic molecule
Emp. Form.C28H31FN6O
Mol. Mass.486.5837
SMILESCn1ccc(n1)-c1ccc2n(cc(C3CCN(CCN4CCNC4=O)CC3)c2c1)-c1ccc(F)cc1