Reaction Details
TargetAlpha-1A adrenergic receptor
LigandBDBM50122806
Substrate/Competitorn/a
Meas. Tech.ChEMBL_33584 (CHEMBL647135)
Ki 3.9±n/a nM
Citation Balle, TPerregaard, JRamirez, MTLarsen, AKSøby, KKLiljefors, TAndersen, K Synthesis and structure-affinity relationship investigations of 5-heteroaryl-substituted analogues of the antipsychotic sertindole. A new class of highly selective alpha(1) adrenoceptor antagonists. J Med Chem46:265-83 (2003) 
 
Alpha-1A adrenergic receptor
Name:Alpha-1A adrenergic receptor
Type:Enzyme Catalytic Domain
Mol. Mass.:51492.08
Organism:CALF
Description:adrenergic Alpha1 0 CALF
Residue:466
BDBM50122806
NameBDBM50122806
Synonyms:3-{4-[1-(4-Fluoro-phenyl)-5-pyrimidin-2-yl-1H-indol-3-yl]-piperidin-1-yl}-propionitrile | CHEMBL317333
TypeSmall organic molecule
Emp. Form.C26H24FN5
Mol. Mass.425.5007
SMILESFc1ccc(cc1)-n1cc(C2CCN(CCC#N)CC2)c2cc(ccc12)-c1ncccn1