Reaction Details
Target5-hydroxytryptamine receptor 2C
LigandBDBM50122803
Substrate/Competitorn/a
Meas. Tech.ChEMBL_2813 (CHEMBL617842)
Ki 2600±n/a nM
Citation Balle, TPerregaard, JRamirez, MTLarsen, AKSøby, KKLiljefors, TAndersen, K Synthesis and structure-affinity relationship investigations of 5-heteroaryl-substituted analogues of the antipsychotic sertindole. A new class of highly selective alpha(1) adrenoceptor antagonists. J Med Chem46:265-83 (2003) 
 
5-hydroxytryptamine receptor 2C
Name:5-hydroxytryptamine receptor 2C
Type:Enzyme
Mol. Mass.:51935.10
Organism:Rattus norvegicus (Rat)
Description:P08909
Residue:460
BDBM50122803
NameBDBM50122803
Synonyms:(SNAP-8719)[4-(4-Amino-6,7-dimethoxy-quinazolin-2-yl)-octahydro-quinoxalin-1-yl]-furan-2-yl-methanone 8-{1-Methyl-2-[4-(2,4,5-trifluoro-phenyl)-piperazin-1-yl]-ethyl}-8-aza-spiro[4.5]decane-7,9-dione SNAP-8719
TypeSmall organic molecule
Emp. Form.C22H28F3N3O2
Mol. Mass.423.4718
SMILESC[C@H](CN1CCN(CC1)c1cc(F)c(F)cc1F)N1C(=O)CC2(CCCC2)CC1=O