Reaction Details
Target5-hydroxytryptamine receptor 1A
LigandBDBM50122798
Substrate/Competitorn/a
Meas. Tech.ChEMBL_894 (CHEMBL615805)
Ki 3.3±n/a nM
Citation Balle, TPerregaard, JRamirez, MTLarsen, AKSøby, KKLiljefors, TAndersen, K Synthesis and structure-affinity relationship investigations of 5-heteroaryl-substituted analogues of the antipsychotic sertindole. A new class of highly selective alpha(1) adrenoceptor antagonists. J Med Chem46:265-83 (2003) 
 
5-hydroxytryptamine receptor 1A
Name:5-hydroxytryptamine receptor 1A
Type:n/a
Mol. Mass.:46122.49
Organism:Homo sapiens (Human)
Description:n/a
Residue:422
BDBM50122798
NameBDBM50122798
Synonyms:1-(2-{4-[1-(4-Fluoro-phenyl)-5-(1-methyl-1H-imidazol-2-yl)-1H-indol-3-yl]-piperidin-1-yl}-ethyl)-imidazolidin-2-one | CHEMBL318735
TypeSmall organic molecule
Emp. Form.C28H31FN6O
Mol. Mass.486.5837
SMILESCn1ccnc1-c1ccc2n(cc(C3CCN(CCN4CCNC4=O)CC3)c2c1)-c1ccc(F)cc1