Reaction Details
Target5-hydroxytryptamine receptor 1B
LigandBDBM50122816
Substrate/Competitorn/a
Meas. Tech.ChEMBL_1336 (CHEMBL616962)
Ki 2.8±n/a nM
Citation Balle, TPerregaard, JRamirez, MTLarsen, AKSøby, KKLiljefors, TAndersen, K Synthesis and structure-affinity relationship investigations of 5-heteroaryl-substituted analogues of the antipsychotic sertindole. A new class of highly selective alpha(1) adrenoceptor antagonists. J Med Chem46:265-83 (2003) 
 
5-hydroxytryptamine receptor 1B
Name:5-hydroxytryptamine receptor 1B
Type:G Protein-Coupled Receptor (GPCR)
Mol. Mass.:43579.17
Organism:Homo sapiens (Human)
Description:Receptor binding assays were performed using human clone stably expressed in CHO cells
Residue:390
BDBM50122816
NameBDBM50122816
Synonyms:1-(2-{4-[1-(4-Fluoro-phenyl)-5-(3-methyl-3H-[1,2,3]triazol-4-yl)-1H-indol-3-yl]-piperidin-1-yl}-ethyl)-imidazolidin-2-one | CHEMBL97184
TypeSmall organic molecule
Emp. Form.C27H30FN7O
Mol. Mass.487.5718
SMILESCn1nncc1-c1ccc2n(cc(C3CCN(CCN4CCNC4=O)CC3)c2c1)-c1ccc(F)cc1