Reaction Details
TargetD(2) dopamine receptor
LigandBDBM50122803
Substrate/Competitorn/a
Meas. Tech.ChEMBL_62077 (CHEMBL672376)
Ki 970±n/a nM
Citation Balle, TPerregaard, JRamirez, MTLarsen, AKSøby, KKLiljefors, TAndersen, K Synthesis and structure-affinity relationship investigations of 5-heteroaryl-substituted analogues of the antipsychotic sertindole. A new class of highly selective alpha(1) adrenoceptor antagonists. J Med Chem46:265-83 (2003) 
 
D(2) dopamine receptor
Name:D(2) dopamine receptor
Type:G Protein-Coupled Receptor (GPCR)
Mol. Mass.:50931.60
Organism:Rattus norvegicus (rat)
Description:P61169
Residue:444
BDBM50122803
NameBDBM50122803
Synonyms:(SNAP-8719)[4-(4-Amino-6,7-dimethoxy-quinazolin-2-yl)-octahydro-quinoxalin-1-yl]-furan-2-yl-methanone 8-{1-Methyl-2-[4-(2,4,5-trifluoro-phenyl)-piperazin-1-yl]-ethyl}-8-aza-spiro[4.5]decane-7,9-dione SNAP-8719
TypeSmall organic molecule
Emp. Form.C22H28F3N3O2
Mol. Mass.423.4718
SMILESC[C@H](CN1CCN(CC1)c1cc(F)c(F)cc1F)N1C(=O)CC2(CCCC2)CC1=O