Reaction Details
TargetD(3) dopamine receptor
LigandBDBM50001786
Substrate/Competitorn/a
Meas. Tech.ChEMBL_62107 (CHEMBL674985)
Ki 2.6±n/a nM
Citation Balle, TPerregaard, JRamirez, MTLarsen, AKSøby, KKLiljefors, TAndersen, K Synthesis and structure-affinity relationship investigations of 5-heteroaryl-substituted analogues of the antipsychotic sertindole. A new class of highly selective alpha(1) adrenoceptor antagonists. J Med Chem46:265-83 (2003) 
 
D(3) dopamine receptor
Name:D(3) dopamine receptor
Type:n/a
Mol. Mass.:44243.43
Organism:Homo sapiens (Human)
Description:n/a
Residue:400
BDBM50001786
NameBDBM50001786
Synonyms:1-(2-{4-[5-chloro-1-(4-fluorophenyl)-1H-indol-3-yl]piperidin-1-yl}ethyl)imidazolidin-2-one CHEMBL12713 | Sertindole
TypeSmall organic molecule
Emp. Form.C24H26ClFN4O
Mol. Mass.440.941
SMILESFc1ccc(cc1)-n1cc(C2CCN(CCN3CCNC3=O)CC2)c2cc(Cl)ccc12