Reaction Details
TargetAlpha-1A adrenergic receptor
LigandBDBM50122824
Substrate/Competitorn/a
Meas. Tech.ChEMBL_33584 (CHEMBL647135)
Ki 0.62±n/a nM
Citation Balle, TPerregaard, JRamirez, MTLarsen, AKSøby, KKLiljefors, TAndersen, K Synthesis and structure-affinity relationship investigations of 5-heteroaryl-substituted analogues of the antipsychotic sertindole. A new class of highly selective alpha(1) adrenoceptor antagonists. J Med Chem46:265-83 (2003) 
 
Alpha-1A adrenergic receptor
Name:Alpha-1A adrenergic receptor
Type:Enzyme Catalytic Domain
Mol. Mass.:51492.08
Organism:CALF
Description:adrenergic Alpha1 0 CALF
Residue:466
BDBM50122824
NameBDBM50122824
Synonyms:3-(2-{4-[1-(4-Fluoro-phenyl)-5-(1-methyl-1H-[1,2,4]triazol-3-yl)-1H-indol-3-yl]-piperidin-1-yl}-ethyl)-oxazolidin-2-one | CHEMBL313424
TypeSmall organic molecule
Emp. Form.C27H29FN6O2
Mol. Mass.488.5566
SMILESCn1cnc(n1)-c1ccc2n(cc(C3CCN(CCN4CCOC4=O)CC3)c2c1)-c1ccc(F)cc1