Reaction Details
Target5-hydroxytryptamine receptor 1B
LigandBDBM50122799
Substrate/Competitorn/a
Meas. Tech.ChEMBL_1336 (CHEMBL616962)
Ki 110±n/a nM
Citation Balle, TPerregaard, JRamirez, MTLarsen, AKSøby, KKLiljefors, TAndersen, K Synthesis and structure-affinity relationship investigations of 5-heteroaryl-substituted analogues of the antipsychotic sertindole. A new class of highly selective alpha(1) adrenoceptor antagonists. J Med Chem46:265-83 (2003) 
 
5-hydroxytryptamine receptor 1B
Name:5-hydroxytryptamine receptor 1B
Type:G Protein-Coupled Receptor (GPCR)
Mol. Mass.:43579.17
Organism:Homo sapiens (Human)
Description:Receptor binding assays were performed using human clone stably expressed in CHO cells
Residue:390
BDBM50122799
NameBDBM50122799
Synonyms:1-(2-{4-[1-(4-Fluoro-phenyl)-5-(1-methyl-1H-pyrazol-3-yl)-1H-indol-3-yl]-piperidin-1-yl}-ethyl)-imidazolidin-2-one | CHEMBL93923
TypeSmall organic molecule
Emp. Form.C28H31FN6O
Mol. Mass.486.5837
SMILESCn1ccc(n1)-c1ccc2n(cc(C3CCN(CCN4CCNC4=O)CC3)c2c1)-c1ccc(F)cc1