Reaction Details
TargetDelta-type opioid receptor
LigandBDBM50122868
Substrate/Competitorn/a
Meas. Tech.ChEMBL_145467 (CHEMBL751254)
Ki 11±n/a nM
Citation Black, SLJales, ARBrandt, WLewis, JWHusbands, SM The role of the side chain in determining relative delta- and kappa-affinity in C5'-substituted analogues of naltrindole. J Med Chem46:314-7 (2003) 
 
Delta-type opioid receptor
Name:Delta-type opioid receptor
Type:G Protein-Coupled Receptor (GPCR)
Mol. Mass.:40382.98
Organism:Homo sapiens (Human)
Description:Competition binding assays were carried out using membrane preparations from transfected HN9.10 cells that constitutively expressed the delta opioid receptor.
Residue:372
BDBM50122868
NameBDBM50122868
Synonyms:7N-benzyl-22-cyclopropylmethyl-2,16-dihydroxy-14-oxa-11,22-diazaheptacyclo[13.9.1.01,13.02,21.04,12.05,10.019,25]pentacosa-4(12),5(10),6,8,15,17,19(25)-heptaene-7-carboxamide | CHEMBL111530
TypeSmall organic molecule
Emp. Form.C34H33N3O4
Mol. Mass.547.6435
SMILESOc1ccc2CC3N(CC4CC4)CC[C@@]45[C@@H](Oc1c24)c1[nH]c2ccc(cc2c1C[C@@]35O)C(=O)NCc1ccccc1