Reaction Details
TargetMu-type opioid receptor
LigandBDBM50122855
Substrate/Competitorn/a
Meas. Tech.ChEMBL_148089 (CHEMBL751571)
Ki 32±n/a nM
Citation Black, SLJales, ARBrandt, WLewis, JWHusbands, SM The role of the side chain in determining relative delta- and kappa-affinity in C5'-substituted analogues of naltrindole. J Med Chem46:314-7 (2003) 
 
Mu-type opioid receptor
Name:Mu-type opioid receptor
Type:G Protein-Coupled Receptor (GPCR)
Mol. Mass.:44789.51
Organism:Homo sapiens (Human)
Description:P35372
Residue:400
BDBM50122855
NameBDBM50122855
Synonyms:1N-{2-[22-cyclopropylmethyl-2,16-dihydroxy-14-oxa-11,22-diazaheptacyclo[13.9.1.01,13.02,21.04,12.05,10.019,25]pentacosa-4(12),5(10),6,8,15,17,19(25)-heptaen-7-yl]ethyl}pentanamide | CHEMBL324644
TypeSmall organic molecule
Emp. Form.C33H39N3O4
Mol. Mass.541.6805
SMILESCCCCC(=O)NCCc1ccc2[nH]c3[C@@H]4Oc5c6c(CC7N(CC8CC8)CC[C@@]46[C@@]7(O)Cc3c2c1)ccc5O