Reaction Details
TargetMu-type opioid receptor
LigandBDBM50122861
Substrate/Competitorn/a
Meas. Tech.ChEMBL_148089 (CHEMBL751571)
Ki 38±n/a nM
Citation Black, SLJales, ARBrandt, WLewis, JWHusbands, SM The role of the side chain in determining relative delta- and kappa-affinity in C5'-substituted analogues of naltrindole. J Med Chem46:314-7 (2003) 
 
Mu-type opioid receptor
Name:Mu-type opioid receptor
Type:G Protein-Coupled Receptor (GPCR)
Mol. Mass.:44789.51
Organism:Homo sapiens (Human)
Description:P35372
Residue:400
BDBM50122861
NameBDBM50122861
Synonyms:22-cyclopropylmethyl-7-(2-ethylaminocarbonylaminoethyl)-14-oxa-11,22-diazaheptacyclo[13.9.1.01,13.02,21.04,12.05,10.019,25]pentacosa-4(12),5(10),6,8,15,17,19(25)-heptaene-2,16-diol | CHEMBL321408
TypeSmall organic molecule
Emp. Form.C31H36N4O4
Mol. Mass.528.6419
SMILESCCNC(=O)NCCc1ccc2[nH]c3[C@@H]4Oc5c6c(CC7N(CC8CC8)CC[C@@]46[C@@]7(O)Cc3c2c1)ccc5O