Reaction Details
TargetKappa-type opioid receptor
LigandBDBM50122857
Substrate/Competitorn/a
Meas. Tech.ChEMBL_145234 (CHEMBL755685)
Ki 8.1±n/a nM
Citation Black, SLJales, ARBrandt, WLewis, JWHusbands, SM The role of the side chain in determining relative delta- and kappa-affinity in C5'-substituted analogues of naltrindole. J Med Chem46:314-7 (2003) 
 
Kappa-type opioid receptor
Name:Kappa-type opioid receptor
Type:G Protein-Coupled Receptor (GPCR)
Mol. Mass.:42648.76
Organism:Homo sapiens (Human)
Description:P41145
Residue:380
BDBM50122857
NameBDBM50122857
Synonyms:22-cyclopropylmethyl-7-(6-hexylaminocarbonylaminoethyl)-14-oxa-11,22-diazaheptacyclo[13.9.1.01,13.02,21.04,12.05,10.019,25]pentacosa-4(12),5(10),6,8,15,17,19(25)-heptaene-2,16-diol | CHEMBL323398
TypeSmall organic molecule
Emp. Form.C35H44N4O4
Mol. Mass.584.7483
SMILESCCCCCCNC(=O)NCCc1ccc2[nH]c3[C@@H]4Oc5c6c(CC7N(CC8CC8)CC[C@@]46[C@@]7(O)Cc3c2c1)ccc5O