Reaction Details
TargetDelta-type opioid receptor
LigandBDBM50133257
Substrate/Competitorn/a
Meas. Tech.ChEMBL_145748 (CHEMBL752637)
EC50 1.8±n/a nM
Citation Hruby, VJ Peptide science: exploring the use of chemical principles and interdisciplinary collaboration for understanding life processes. J Med Chem46:4215-31 (2003) 
 
Delta-type opioid receptor
Name:Delta-type opioid receptor
Type:Enzyme Catalytic Domain
Mol. Mass.:40577.25
Organism:MOUSE
Description:P32300
Residue:372
BDBM50133257
NameBDBM50133257
Synonyms:CHEMBL334369 | [(2S,3R)-TMT1]DPDPE
TypeSmall organic molecule
Emp. Form.C33H47N5O7S2
Mol. Mass.689.886
SMILESC[C@@H]([C@H](N)C(=O)N[C@H](C(=O)NCC(=O)N[C@@H](Cc1ccccc1)C(=O)N[C@H](C(O)=O)C(C)(C)S)C(C)(C)S)c1c(C)cc(O)cc1C