Reaction Details
TargetD(3) dopamine receptor
LigandBDBM50133923
Substrate/Competitorn/a
Meas. Tech.ChEMBL_62280 (CHEMBL675050)
Ki 0.810±n/a nM
Citation Varady, JWu, XFang, XMin, JHu, ZLevant, BWang, S Molecular modeling of the three-dimensional structure of dopamine 3 (D3) subtype receptor: discovery of novel and potent D3 ligands through a hybrid pharmacophore- and structure-based database searching approach. J Med Chem46:4377-92 (2003) 
 
D(3) dopamine receptor
Name:D(3) dopamine receptor
Type:n/a
Mol. Mass.:44243.43
Organism:Homo sapiens (Human)
Description:n/a
Residue:400
BDBM50133923
NameBDBM50133923
Synonyms:4-Cyano-1-methoxy-naphthalene-2-carboxylic acid (1-butyl-pyrrolidin-2-ylmethyl)-amide | CHEMBL286252
TypeSmall organic molecule
Emp. Form.C22H27N3O2
Mol. Mass.365.4687
SMILESCCCCN1CCCC1CNC(=O)c1cc(C#N)c2ccccc2c1OC