Reaction Details
TargetD(3) dopamine receptor
LigandBDBM50133933
Substrate/Competitorn/a
Meas. Tech.ChEMBL_62282 (CHEMBL675052)
Ki 1.1±n/a nM
Citation Varady, JWu, XFang, XMin, JHu, ZLevant, BWang, S Molecular modeling of the three-dimensional structure of dopamine 3 (D3) subtype receptor: discovery of novel and potent D3 ligands through a hybrid pharmacophore- and structure-based database searching approach. J Med Chem46:4377-92 (2003) 
 
D(3) dopamine receptor
Name:D(3) dopamine receptor
Type:n/a
Mol. Mass.:44243.43
Organism:Homo sapiens (Human)
Description:n/a
Residue:400
BDBM50133933
NameBDBM50133933
Synonyms:(R)-1-Propyl-2,3,10,10a-tetrahydro-1H,4aH-4,9-dioxa-1-aza-phenanthren-6-ol | CHEMBL335570
TypeSmall organic molecule
Emp. Form.C14H19NO3
Mol. Mass.249.3056
SMILESCCCN1CCOC2[C@H]1COc1ccc(O)cc21