Reaction Details
TargetHistone deacetylase 4
LigandBDBM50105676
Substrate/Competitorn/a
Meas. Tech.ChEMBL_207282 (CHEMBL811365)
EC50>25000±n/a nM
Citation Miller, TAWitter, DJBelvedere, S Histone deacetylase inhibitors. J Med Chem46:5097-116 (2003) 
 
Histone deacetylase 4
Name:Histone deacetylase 4
Type:Enzyme
Mol. Mass.:119049.39
Organism:Homo sapiens (Human)
Description:P56524
Residue:1084
BDBM50105676
NameBDBM50105676
Synonyms:2-(4-Benzenesulfonylamino-benzyl)-N-hydroxy-3-methyl-butyramide US8796330, 81
TypeSmall organic molecule
Emp. Form.C18H22N2O4S
Mol. Mass.362.443
SMILESCC(C)C(Cc1ccc(NS(=O)(=O)c2ccccc2)cc1)C(=O)NO