Reaction Details
TargetHistone deacetylase 4
LigandBDBM50105682
Substrate/Competitorn/a
Meas. Tech.ChEMBL_207282 (CHEMBL811365)
EC50 5000±n/a nM
Citation Miller, TAWitter, DJBelvedere, S Histone deacetylase inhibitors. J Med Chem46:5097-116 (2003) 
 
Histone deacetylase 4
Name:Histone deacetylase 4
Type:Enzyme
Mol. Mass.:119049.39
Organism:Homo sapiens (Human)
Description:P56524
Residue:1084
BDBM50105682
NameBDBM50105682
Synonyms:4-Benzenesulfonylamino-N-hydroxy-benzamide N-hydroxy-4-(phenylsulfonamido)benzamide
TypeSmall organic molecule
Emp. Form.C13H12N2O4S
Mol. Mass.292.31
SMILESONC(=O)c1ccc(NS(=O)(=O)c2ccccc2)cc1