Reaction Details
TargetHistone deacetylase 4
LigandBDBM50105677
Substrate/Competitorn/a
Meas. Tech.ChEMBL_207282 (CHEMBL811365)
EC50 10000±n/a nM
Citation Miller, TAWitter, DJBelvedere, S Histone deacetylase inhibitors. J Med Chem46:5097-116 (2003) 
 
Histone deacetylase 4
Name:Histone deacetylase 4
Type:Enzyme
Mol. Mass.:119049.39
Organism:Homo sapiens (Human)
Description:P56524
Residue:1084
BDBM50105677
NameBDBM50105677
Synonyms:(E)-N-Hydroxy-3-[4-(toluene-4-sulfonylamino)-phenyl]-acrylamide N-Hydroxy-3-[4-(toluene-4-sulfonylamino)-phenyl]-acrylamide US8796330, 108
TypeSmall organic molecule
Emp. Form.C16H16N2O4S
Mol. Mass.332.374
SMILESCc1ccc(cc1)S(=O)(=O)Nc1ccc(\C=C\C(=O)NO)cc1