Reaction Details
TargetPurine nucleoside phosphorylase
LigandBDBM50422435
Substrate/Competitorn/a
Meas. Tech.ChEMBL_162006 (CHEMBL764177)
Ki 1.4±n/a nM
Citation Evans, GBFurneaux, RHLewandowicz, ASchramm, VLTyler, PC Synthesis of second-generation transition state analogues of human purine nucleoside phosphorylase. J Med Chem46:5271-6 (2003) 
 
Purine nucleoside phosphorylase
Name:Purine nucleoside phosphorylase
Type:Enzyme
Mol. Mass.:32119.53
Organism:Homo sapiens (Human)
Description:n/a
Residue:289
BDBM50422435
NameBDBM50422435
Synonyms:CHEMBL2311112
TypeSmall organic molecule
Emp. Form.C10H13N5O4
Mol. Mass.267.2413
SMILESOC[C@H]1N[C@H]([C@H](O)[C@@H]1O)c1[nH]nc2c1nc[nH]c2=O