Reaction Details
TargetDelta-type opioid receptor
LigandBDBM50136122
Substrate/Competitorn/a
Meas. Tech.ChEMBL_145490 (CHEMBL752133)
Ki 27±n/a nM
Citation Black, SLChauvignac, CGrundt, PMiller, CNWood, STraynor, JRLewis, JWHusbands, SM Guanidino N-substituted and N,N-disubstituted derivatives of the kappa-opioid antagonist GNTI. J Med Chem46:5505-11 (2003) 
 
Delta-type opioid receptor
Name:Delta-type opioid receptor
Type:G Protein-Coupled Receptor (GPCR)
Mol. Mass.:40382.98
Organism:Homo sapiens (Human)
Description:Competition binding assays were carried out using membrane preparations from transfected HN9.10 cells that constitutively expressed the delta opioid receptor.
Residue:372
BDBM50136122
NameBDBM50136122
Synonyms:7-benzylamino(imino)methylamino-22-cyclopropylmethyl-14-oxa-11,22-diazaheptacyclo[13.9.1.01,13.02,21.04,12.05,10.019,25]pentacosa-4(12),5(10),6,8,15,17,19(25)-heptaene-2,16-diol
TypeSmall organic molecule
Emp. Form.C34H35N5O3
Mol. Mass.561.6734
SMILESNC(NCc1ccccc1)=Nc1ccc2[nH]c3[C@@H]4Oc5c6c(CC7N(CC8CC8)CC[C@@]46[C@@]7(O)Cc3c2c1)ccc5O