Reaction Details
TargetKappa-type opioid receptor
LigandBDBM50136110
Substrate/Competitorn/a
Meas. Tech.ChEMBL_145259 (CHEMBL751037)
Ki 7±n/a nM
Citation Black, SLChauvignac, CGrundt, PMiller, CNWood, STraynor, JRLewis, JWHusbands, SM Guanidino N-substituted and N,N-disubstituted derivatives of the kappa-opioid antagonist GNTI. J Med Chem46:5505-11 (2003) 
 
Kappa-type opioid receptor
Name:Kappa-type opioid receptor
Type:G Protein-Coupled Receptor (GPCR)
Mol. Mass.:42648.76
Organism:Homo sapiens (Human)
Description:P41145
Residue:380
BDBM50136110
NameBDBM50136110
Synonyms:7-butylamino(butylimino)methylamino-22-cyclopropylmethyl-14-oxa-11,22-diazaheptacyclo[13.9.1.01,13.02,21.04,12.05,10.019,25]pentacosa-4(12),5(10),6,8,15,17,19(25)-heptaene-2,16-diol
TypeSmall organic molecule
Emp. Form.C35H45N5O3
Mol. Mass.583.7635
SMILESCCCCNC(NCCCC)=Nc1ccc2[nH]c3[C@@H]4Oc5c6c(CC7N(CC8CC8)CC[C@@]46[C@@]7(O)Cc3c2c1)ccc5O