Reaction Details
TargetKappa-type opioid receptor
LigandBDBM50136115
Substrate/Competitorn/a
Meas. Tech.ChEMBL_145259 (CHEMBL751037)
Ki 2.1±n/a nM
Citation Black, SLChauvignac, CGrundt, PMiller, CNWood, STraynor, JRLewis, JWHusbands, SM Guanidino N-substituted and N,N-disubstituted derivatives of the kappa-opioid antagonist GNTI. J Med Chem46:5505-11 (2003) 
 
Kappa-type opioid receptor
Name:Kappa-type opioid receptor
Type:G Protein-Coupled Receptor (GPCR)
Mol. Mass.:42648.76
Organism:Homo sapiens (Human)
Description:P41145
Residue:380
BDBM50136115
NameBDBM50136115
Synonyms:22-cyclopropylmethyl-7-[2-imino(4-nitrobenzylamino)methylaminoethyl]-14-oxa-11,22-diazaheptacyclo[13.9.1.01,13.02,21.04,12.05,10.019,25]pentacosa-4(12),5(10),6,8,15,17,19(25)-heptaene-2,16-diol
TypeSmall organic molecule
Emp. Form.C36H38N6O5
Mol. Mass.634.7241
SMILESOc1ccc2CC3N(CC4CC4)CCC45C(Oc1c24)c1[nH]c2ccc(CC[N-]C(=[NH2+])NCc4ccc(cc4)[N+]([O-])=O)cc2c1CC35O