Reaction Details
TargetMu-type opioid receptor
LigandBDBM50136119
Substrate/Competitorn/a
Meas. Tech.ChEMBL_148230 (CHEMBL753390)
Ki 7.9±n/a nM
Citation Black, SLChauvignac, CGrundt, PMiller, CNWood, STraynor, JRLewis, JWHusbands, SM Guanidino N-substituted and N,N-disubstituted derivatives of the kappa-opioid antagonist GNTI. J Med Chem46:5505-11 (2003) 
 
Mu-type opioid receptor
Name:Mu-type opioid receptor
Type:G Protein-Coupled Receptor (GPCR)
Mol. Mass.:44789.51
Organism:Homo sapiens (Human)
Description:P35372
Residue:400
BDBM50136119
NameBDBM50136119
Synonyms:7-[4-aminobenzylamino(imino)methylamino]-22-cyclopropylmethyl-14-oxa-11,22-diazaheptacyclo[13.9.1.01,13.02,21.04,12.05,10.019,25]pentacosa-4(12),5(10),6,8,15,17,19(25)-heptaene-2,16-diol
TypeSmall organic molecule
Emp. Form.C34H36N6O3
Mol. Mass.576.688
SMILESNC(NCc1ccc(N)cc1)=Nc1ccc2[nH]c3[C@@H]4Oc5c6c(CC7N(CC8CC8)CC[C@@]46[C@@]7(O)Cc3c2c1)ccc5O