Reaction Details
TargetKappa-type opioid receptor
LigandBDBM50123761
Substrate/Competitorn/a
Meas. Tech.ChEMBL_145988 (CHEMBL750582)
Ki 69±n/a nM
Citation Harrison, BAPasternak, GWVerdine, GL 2,6-Dimethyltyrosine analogues of a stereodiversified ligand library: highly potent, selective, non-peptidic mu opioid receptor agonists. J Med Chem46:677-80 (2003) 
 
Kappa-type opioid receptor
Name:Kappa-type opioid receptor
Type:G Protein-Coupled Receptor (GPCR)
Mol. Mass.:42744.99
Organism:Cavia porcellus (domestic guinea pig)
Description:P41144
Residue:380
BDBM50123761
NameBDBM50123761
Synonyms:(E)-(1S,2R,6R,7R)-2,6-Dihydroxy-1-(4-hydroxy-2,6-dimethyl-benzyl)-7-phenethylcarbamoyl-8-phenyl-oct-4-enyl-ammonium
TypeSmall organic molecule
Emp. Form.C32H41N2O4
Mol. Mass.517.6784
SMILESCc1cc(O)cc(C)c1C[C@H]([NH3+])[C@H](O)C\C=C\[C@@H](O)[C@@H](Cc1ccccc1)C(=O)NCCc1ccccc1