Reaction Details
TargetMu-type opioid receptor
LigandBDBM50123753
Substrate/Competitorn/a
Meas. Tech.ChEMBL_148231 (CHEMBL753391)
Ki 1.2±n/a nM
Citation Harrison, BAPasternak, GWVerdine, GL 2,6-Dimethyltyrosine analogues of a stereodiversified ligand library: highly potent, selective, non-peptidic mu opioid receptor agonists. J Med Chem46:677-80 (2003) 
 
Mu-type opioid receptor
Name:Mu-type opioid receptor
Type:G Protein-Coupled Receptor (GPCR)
Mol. Mass.:44789.51
Organism:Homo sapiens (Human)
Description:P35372
Residue:400
BDBM50123753
NameBDBM50123753
Synonyms:(E)-(1S,2S,6R,7S)-7-((S)-1-Carbamoyl-2-phenyl-ethylcarbamoyl)-2,6-dihydroxy-1-(4-hydroxy-2,6-dimethyl-benzyl)-8-phenyl-oct-4-enyl-ammonium
TypeSmall organic molecule
Emp. Form.C33H42N3O5
Mol. Mass.560.7031
SMILESCc1cc(O)cc(C)c1C[C@H]([NH3+])[C@@H](O)C\C=C\[C@@H](O)[C@H](Cc1ccccc1)C(=O)N[C@@H](Cc1ccccc1)C(N)=O