Reaction Details
TargetHistamine H3 receptor
LigandBDBM50126874
Substrate/Competitorn/a
Meas. Tech.ChEMBL_83651 (CHEMBL693111)
Ki 761±n/a nM
Citation Mikó, TLigneau, XPertz, HHGanellin, CRArrang, JMSchwartz, JCSchunack, WStark, H Novel nonimidazole histamine H3 receptor antagonists: 1-(4-(phenoxymethyl)benzyl)piperidines and related compounds. J Med Chem46:1523-30 (2003) 
 
Histamine H3 receptor
Name:Histamine H3 receptor
Type:G Protein-Coupled Receptor (GPCR)
Mol. Mass.:48691.47
Organism:Homo sapiens (Human)
Description:Binding assays were using CHO cells stably expressing hH3R receptors.
Residue:445
BDBM50126874
NameBDBM50126874
Synonyms:1-[4-(4-Styryl-phenoxymethyl)-benzyl]-piperidine; compound with oxalic acid | CHEMBL289935
TypeSmall organic molecule
Emp. Form.C27H29NO
Mol. Mass.383.5253
SMILESC(Oc1ccc(\C=C\c2ccccc2)cc1)c1ccc(CN2CCCCC2)cc1