Reaction Details
TargetHistamine H3 receptor
LigandBDBM50126902
Substrate/Competitorn/a
Meas. Tech.ChEMBL_83477 (CHEMBL693948)
Kd 18.2±n/a nM
Citation Mikó, TLigneau, XPertz, HHGanellin, CRArrang, JMSchwartz, JCSchunack, WStark, H Novel nonimidazole histamine H3 receptor antagonists: 1-(4-(phenoxymethyl)benzyl)piperidines and related compounds. J Med Chem46:1523-30 (2003) 
 
Histamine H3 receptor
Name:Histamine H3 receptor
Type:Enzyme Catalytic Domain
Mol. Mass.:48753.61
Organism:GUINEA PIG
Description:HISTAMINE H3 HRH3 GUINEA PIG::Q9JI35
Residue:445
BDBM50126902
NameBDBM50126902
Synonyms:1-[4-(4-Pyrrolidin-1-ylmethyl-benzyloxy)-phenyl]-ethanone; compound with oxalic acid | CHEMBL290613
TypeSmall organic molecule
Emp. Form.C20H23NO2
Mol. Mass.309.4021
SMILESCC(=O)c1ccc(OCc2ccc(CN3CCCC3)cc2)cc1