Reaction Details
TargetHistamine H2 receptor
LigandBDBM50126902
Substrate/Competitorn/a
Meas. Tech.ChEMBL_85342 (CHEMBL695016)
Kd 7762.47±n/a nM
Citation Mikó, TLigneau, XPertz, HHGanellin, CRArrang, JMSchwartz, JCSchunack, WStark, H Novel nonimidazole histamine H3 receptor antagonists: 1-(4-(phenoxymethyl)benzyl)piperidines and related compounds. J Med Chem46:1523-30 (2003) 
 
Histamine H2 receptor
Name:Histamine H2 receptor
Type:G Protein-Coupled Receptor (GPCR)
Mol. Mass.:40567.22
Organism:Cavia porcellus (domestic guinea pig)
Description:For the H2 receptor-binding assays, guinea pig striatum was used.
Residue:359
BDBM50126902
NameBDBM50126902
Synonyms:1-[4-(4-Pyrrolidin-1-ylmethyl-benzyloxy)-phenyl]-ethanone; compound with oxalic acid | CHEMBL290613
TypeSmall organic molecule
Emp. Form.C20H23NO2
Mol. Mass.309.4021
SMILESCC(=O)c1ccc(OCc2ccc(CN3CCCC3)cc2)cc1