Reaction Details
TargetHistamine H3 receptor
LigandBDBM50126888
Substrate/Competitorn/a
Meas. Tech.ChEMBL_83477 (CHEMBL693948)
Kd 38.02±n/a nM
Citation Mikó, TLigneau, XPertz, HHGanellin, CRArrang, JMSchwartz, JCSchunack, WStark, H Novel nonimidazole histamine H3 receptor antagonists: 1-(4-(phenoxymethyl)benzyl)piperidines and related compounds. J Med Chem46:1523-30 (2003) 
 
Histamine H3 receptor
Name:Histamine H3 receptor
Type:Enzyme Catalytic Domain
Mol. Mass.:48753.61
Organism:GUINEA PIG
Description:HISTAMINE H3 HRH3 GUINEA PIG::Q9JI35
Residue:445
BDBM50126888
NameBDBM50126888
Synonyms:1-[4-(4-Piperidin-1-ylmethyl-benzyloxy)-benzyl]-piperazine; compound with oxalic acid CHEMBL416053
TypeSmall organic molecule
Emp. Form.C25H34N2O
Mol. Mass.378.5503
SMILESC(Oc1ccc(CN2CCCCC2)cc1)c1ccc(CN2CCCCC2)cc1