Reaction Details
TargetKappa-type opioid receptor
LigandBDBM50127166
Substrate/Competitorn/a
Meas. Tech.ChEMBL_145267 (CHEMBL872675)
Ki 0.6±n/a nM
Citation Greiner, ESpetea, MKrassnig, RSchüllner, FAceto, MHarris, LSTraynor, JRWoods, JHCoop, ASchmidhammer, H Synthesis and biological evaluation of 14-alkoxymorphinans. 18. N-substituted 14-phenylpropyloxymorphinan-6-ones with unanticipated agonist properties: extending the scope of common structure-activity relationships. J Med Chem46:1758-63 (2003) 
 
Kappa-type opioid receptor
Name:Kappa-type opioid receptor
Type:G Protein-Coupled Receptor (GPCR)
Mol. Mass.:42648.76
Organism:Homo sapiens (Human)
Description:P41145
Residue:380
BDBM50127166
NameBDBM50127166
Synonyms:10-hydroxy-4-phenethyl-17-(3-phenylpropoxy)-(13R,17S)-12-oxa-4-azapentacyclo[9.6.1.01,13.05,17.07,18]octadeca-7,9,11(18)-trien-14-one
TypeSmall organic molecule
Emp. Form.C33H35NO4
Mol. Mass.509.6353
SMILESOc1ccc2CC3N(CCc4ccccc4)CC[C@@]45[C@@H](Oc1c24)C(=O)CC[C@@]35OCCCc1ccccc1