Reaction Details
Target6-phosphogluconate dehydrogenase, decarboxylating
LigandBDBM50148769
Substrate/Competitorn/a
Meas. Tech.ChEMBL_4337 (CHEMBL618442)
Ki 1520±n/a nM
Citation Dardonville, CRinaldi, EBarrett, MPBrun, RGilbert, IHHanau, S Selective inhibition of Trypanosoma brucei 6-phosphogluconate dehydrogenase by high-energy intermediate and transition-state analogues. J Med Chem47:3427-37 (2004) 
 
6-phosphogluconate dehydrogenase, decarboxylating
Name:6-phosphogluconate dehydrogenase, decarboxylating
Type:Protein
Mol. Mass.:53143.42
Organism:Homo sapiens (Human)
Description:P52209
Residue:483
BDBM50148769
NameBDBM50148769
Synonyms:(R)-Phosphoric acid mono-((R)-3-carbamoyl-2,3-dihydroxy-propyl) ester | CHEMBL323922
TypeSmall organic molecule
Emp. Form.C4H10NO7P
Mol. Mass.215.0985
SMILESNC(=O)[C@H](O)[C@H](O)COP(O)(O)=O