Reaction Details
TargetCytochrome P450 2C9
LigandBDBM50139799
Substrate/Competitorn/a
Meas. Tech.ChEMBL_51556 (CHEMBL661229)
Ki 17000±n/a nM
Citation Afzelius, LZamora, IMasimirembwa, CMKarlén, AAndersson, TBMecucci, SBaroni, MCruciani, G Conformer- and alignment-independent model for predicting structurally diverse competitive CYP2C9 inhibitors. J Med Chem47:907-14 (2004) 
 
Cytochrome P450 2C9
Name:Cytochrome P450 2C9
Type:Enzyme
Mol. Mass.:55636.33
Organism:Homo sapiens (Human)
Description:P11712
Residue:490
BDBM50139799
NameBDBM50139799
Synonyms:2-(2,5-Dichloro-thiophene-3-sulfonylamino)-N-(1,3,5-trimethyl-1H-pyrazol-4-yl)-benzamide | CHEMBL353413
TypeSmall organic molecule
Emp. Form.C17H16Cl2N4O3S2
Mol. Mass.459.37
SMILESCc1nn(C)c(C)c1NC(=O)c1ccccc1NS(=O)(=O)c1cc(Cl)sc1Cl